Target
Retinoic acid receptor RXR-alpha
Ligand
BDBM50141602
Substrate
Meas. Tech.
ChEMBL_196599 (CHEMBL799677)
IC50
194±n/a nM
Citation
 Michellys, PYD'Arrigo, JGrese, TAKaranewsky, DSLeibowitz, MDMais, DAMapes, CMReifel-Miller, ARungta, DBoehm, MF Design, synthesis and structure-activity relationship of novel RXR-selective modulators. Bioorg Med Chem Lett 14:1593-8 (2004)  
Target
Name:
Retinoic acid receptor RXR-alpha
Synonyms:
NR2B1 Nuclear receptor subfamily 4 group A member 2 RXRA Retinoic acid receptor RXR-alpha/gamma Retinoid receptor
Type:
PROTEIN
Mol. Mass.:
50820.38
Organism:
Homo sapiens (Human)
Description:
ChEMBL_1456363
Residue:
462
  
Inhibitor
Name:
BDBM50141602
Synonyms:
(E)-3-{7-[2-(3-Fluoro-propoxy)-3,5-diisopropyl-phenyl]-benzofuran-2-yl}-but-2-enoic acid | CHEMBL290399
Type:
Small organic molecule
Emp. Form.:
C27H31FO4
Mol. Mass.:
438.531
SMILES:
CC(C)c1cc(C(C)C)c(OCCCF)c(c1)-c1cccc2cc(oc12)C(\C)=C\C(O)=O
: