Target
1-acyl-sn-glycerol-3-phosphate acyltransferase beta
Ligand
BDBM50144725
Substrate
Meas. Tech.
ChEBML_100168
IC50
28±n/a nM
Citation
 Gong, BHong, FKohm, CJenkins, STulinsky, JBhatt, RDe Vries, PSinger, JWKlein, P Synthesis, SAR, and antitumor properties of diamino-C,N-diarylpyrimidine positional isomers: inhibitors of lysophosphatidic acid acyltransferase-beta. Bioorg Med Chem Lett 14:2303-8 (2004)  
Target
Name:
1-acyl-sn-glycerol-3-phosphate acyltransferase beta
Synonyms:
1-acylglycerol-3-phosphate O-acyltransferase beta PLCB_HUMAN
Type:
PROTEIN
Mol. Mass.:
30924.09
Organism:
Homo sapiens (Human)
Description:
ChEMBL_321473
Residue:
278
  
Inhibitor
Name:
BDBM50144725
Synonyms:
CHEMBL424605 | N*4*-(4-Bromo-phenyl)-6-(5-chloro-2-methoxy-phenyl)-pyrimidine-2,4-diamine
Type:
Small organic molecule
Emp. Form.:
C17H14BrClN4O
Mol. Mass.:
405.676
SMILES:
COc1ccc(Cl)cc1-c1cc(Nc2ccc(Br)cc2)nc(N)n1
: