Target
Adenosine receptor A2a
Ligand
BDBM50147665
Substrate
Meas. Tech.
ChEBML_31364
Ki
2±n/a nM
Citation
 Guba, WNettekoven, MPüllmann, BRiemer, CSchmitt, S Comparison of inhibitory activity of isomeric triazolopyridine derivatives towards adenosine receptor subtypes or do similar structures reveal similar bioactivities? Bioorg Med Chem Lett 14:3307-12 (2004)  
Target
Name:
Adenosine receptor A2a
Synonyms:
A2A adenosine receptor (hA2A) ADENOSINE A2 ADORA2 Adenosine A2A receptor (A2AAR)
Type:
G Protein-Coupled Receptor (GPCR)
Mol. Mass.:
44716.46
Organism:
Homo sapiens (Human)
Description:
P29274
Residue:
412
  
Inhibitor
Name:
BDBM50147665
Synonyms:
CHEMBL112773 | [5-Amino-2-(5-bromo-furan-2-yl)-[1,2,4]triazolo[1,5-a]pyridin-7-yl]-((R)-2-methoxymethyl-pyrrolidin-1-yl)-methanone
Type:
Small organic molecule
Emp. Form.:
C17H18BrN5O3
Mol. Mass.:
420.261
SMILES:
COC[C@H]1CCCN1C(=O)c1cc(N)n2nc(nc2c1)-c1ccc(Br)o1
: