Target
Adenosine receptor A2a
Ligand
BDBM50147668
Substrate
Meas. Tech.
ChEBML_31364
Ki
104±n/a nM
Citation
 Guba, WNettekoven, MPüllmann, BRiemer, CSchmitt, S Comparison of inhibitory activity of isomeric triazolopyridine derivatives towards adenosine receptor subtypes or do similar structures reveal similar bioactivities? Bioorg Med Chem Lett 14:3307-12 (2004)  
Target
Name:
Adenosine receptor A2a
Synonyms:
A2A adenosine receptor (hA2A) ADENOSINE A2 ADORA2 Adenosine A2A receptor (A2AAR)
Type:
G Protein-Coupled Receptor (GPCR)
Mol. Mass.:
44716.46
Organism:
Homo sapiens (Human)
Description:
P29274
Residue:
412
  
Inhibitor
Name:
BDBM50147668
Synonyms:
(5-Amino-2-thiophen-2-yl-[1,2,4]triazolo[1,5-a]pyridin-7-yl)-pyrrolidin-1-yl-methanone | CHEMBL114405
Type:
Small organic molecule
Emp. Form.:
C15H15N5OS
Mol. Mass.:
313.378
SMILES:
Nc1cc(cc2nc(nn12)-c1cccs1)C(=O)N1CCCC1
: