Target
17beta-hydroxysteroid dehydrogenase
Ligand
BDBM50149606
Substrate
Meas. Tech.
ChEMBL_306373 (CHEMBL828344)
IC50
13000±n/a nM
Citation
 Gobec, SSova, MKristan, KRizner, TL Cinnamic acid esters as potent inhibitors of fungal 17beta-hydroxysteroid dehydrogenase--a model enzyme of the short-chain dehydrogenase/reductase superfamily. Bioorg Med Chem Lett 14:3933-6 (2004)  
Target
Name:
17beta-hydroxysteroid dehydrogenase
Synonyms:
17-beta-hydroxysteroid-dehydrogenase
Type:
PROTEIN
Mol. Mass.:
28901.23
Organism:
Curvularia lunata
Description:
ChEMBL_306373
Residue:
270
  
Inhibitor
Name:
BDBM50149606
Synonyms:
(E)-3-Phenyl-acrylic acid 4-cyano-phenyl ester | CHEMBL182501
Type:
Small organic molecule
Emp. Form.:
C16H11NO2
Mol. Mass.:
249.264
SMILES:
O=C(Oc1ccc(cc1)C#N)\C=C\c1ccccc1
: