Target
17beta-hydroxysteroid dehydrogenase
Ligand
BDBM50149612
Substrate
Meas. Tech.
ChEMBL_306373 (CHEMBL828344)
IC50
26000±n/a nM
Citation
 Gobec, SSova, MKristan, KRizner, TL Cinnamic acid esters as potent inhibitors of fungal 17beta-hydroxysteroid dehydrogenase--a model enzyme of the short-chain dehydrogenase/reductase superfamily. Bioorg Med Chem Lett 14:3933-6 (2004)  
Target
Name:
17beta-hydroxysteroid dehydrogenase
Synonyms:
17-beta-hydroxysteroid-dehydrogenase
Type:
PROTEIN
Mol. Mass.:
28901.23
Organism:
Curvularia lunata
Description:
ChEMBL_306373
Residue:
270
  
Inhibitor
Name:
BDBM50149612
Synonyms:
(E)-3-Phenyl-acrylic acid phenyl ester phenyl cinnamate
Type:
Small organic molecule
Emp. Form.:
C15H12O2
Mol. Mass.:
224.2546
SMILES:
O=C(Oc1ccccc1)\C=C\c1ccccc1
: