Target
17beta-hydroxysteroid dehydrogenase
Ligand
BDBM50149614
Substrate
Meas. Tech.
ChEMBL_306373 (CHEMBL828344)
IC50
10000±n/a nM
Citation
 Gobec, SSova, MKristan, KRizner, TL Cinnamic acid esters as potent inhibitors of fungal 17beta-hydroxysteroid dehydrogenase--a model enzyme of the short-chain dehydrogenase/reductase superfamily. Bioorg Med Chem Lett 14:3933-6 (2004)  
Target
Name:
17beta-hydroxysteroid dehydrogenase
Synonyms:
17-beta-hydroxysteroid-dehydrogenase
Type:
PROTEIN
Mol. Mass.:
28901.23
Organism:
Curvularia lunata
Description:
ChEMBL_306373
Residue:
270
  
Inhibitor
Name:
BDBM50149614
Synonyms:
(E)-3-Phenyl-acrylic acid 1,3-dioxo-1,3-dihydro-isoindol-2-ylmethyl ester | CHEMBL183456
Type:
Small organic molecule
Emp. Form.:
C18H13NO4
Mol. Mass.:
307.3001
SMILES:
O=C(OCN1C(=O)c2ccccc2C1=O)\C=C\c1ccccc1
: