Target
5-hydroxytryptamine receptor 7
Ligand
BDBM50150439
Substrate
Meas. Tech.
ChEMBL_302554 (CHEMBL839517)
Ki
0.3±n/a nM
Citation
 Denhart, DJPurandare, AVCatt, JDKing, HDGao, ADeskus, JAPoss, MAStark, ADTorrente, JRJohnson, GMattson, RJ Diaminopyrimidine and diaminopyridine 5-HT7 ligands. Bioorg Med Chem Lett 14:4249-52 (2004)  
Target
Name:
5-hydroxytryptamine receptor 7
Synonyms:
5-HT-7 5-HT7 5-HT7S 5HT7 HTR7 | Serotonin receptor 7
Type:
G Protein-Coupled Receptor (GPCR)
Mol. Mass.:
53573.08
Organism:
Homo sapiens (Human)
Description:
P34969
Residue:
479
  
Inhibitor
Name:
BDBM50150439
Synonyms:
CHEMBL182923 | N*2*-Phenethyl-N*4*-((S)-1-phenyl-ethyl)-pyridine-2,4-diamine
Type:
Small organic molecule
Emp. Form.:
C21H23N3
Mol. Mass.:
317.4274
SMILES:
C[C@H](Nc1ccnc(NCCc2ccccc2)c1)c1ccccc1
: