Target
5-hydroxytryptamine receptor 1A
Ligand
BDBM50151969
Substrate
Meas. Tech.
ChEBML_306314
IC50
0.010000±n/a nM
Citation
 Heinrich, TBöttcher, HBartoszyk, GDGreiner, HESeyfried, CAVan Amsterdam, C Indolebutylamines as selective 5-HT(1A) agonists. J Med Chem 47:4677-83 (2004)  
Target
Name:
5-hydroxytryptamine receptor 1A
Synonyms:
5-HT-1A 5-HT1A 5-hydroxytryptamine receptor 1A (5HT1A) 5ht1a Htr1a Serotonin 1a (5-HT1a) receptor/Adrenergic receptor alpha-1 | Serotonin receptor 1A
Type:
G Protein-Coupled Receptor (GPCR)
Mol. Mass.:
46445.29
Organism:
Rattus norvegicus (rat)
Description:
Binding assays were performed using rat hippocampal membranes.
Residue:
422
  
Inhibitor
Name:
BDBM50151969
Synonyms:
3-{4-[4-(2-Cyano-3-fluoro-phenyl)-piperazin-1-yl]-butyl}-1H-indole-5-carboxylic acid amide | CHEMBL186423
Type:
Small organic molecule
Emp. Form.:
C24H26FN5O
Mol. Mass.:
419.4945
SMILES:
NC(=O)c1ccc2[nH]cc(CCCCN3CCN(CC3)c3cccc(F)c3C#N)c2c1
: