Target
Pro-cathepsin H
Ligand
BDBM50152520
Substrate
Meas. Tech.
ChEMBL_306357 (CHEMBL828234)
IC50
>12000±n/a nM
Citation
 Barrett, DGCatalano, JGDeaton, DNHassell, AMLong, STMiller, ABMiller, LRShewchuk, LMWells-Knecht, KJWillard, DHWright, LL Potent and selective P2-P3 ketoamide inhibitors of cathepsin K with good pharmacokinetic properties via favorable P1', P1, and/or P3 substitutions. Bioorg Med Chem Lett 14:4897-902 (2004)  
Target
Name:
Pro-cathepsin H
Synonyms:
CATH_HUMAN CPSB Cathepsin H Cathepsin H light chain | Cathepsin H mini chain
Type:
PROTEIN
Mol. Mass.:
37402.31
Organism:
Homo sapiens (Human)
Description:
ChEMBL_1459870
Residue:
335
  
Inhibitor
Name:
BDBM50152520
Synonyms:
1-benzylcyclopentyl(S)-1,2-dioxo-1-((R)-1-phenylethylamino)heptan-3-ylcarbamate [(S)-1-((R)-1-Phenyl-ethylaminooxalyl)-pentyl]-carbamic acid 1-benzyl-cyclopentyl ester
Type:
Small organic molecule
Emp. Form.:
C28H36N2O4
Mol. Mass.:
464.5964
SMILES:
CCCC[C@H](NC(=O)OC1(Cc2ccccc2)CCCC1)C(=O)C(=O)N[C@H](C)c1ccccc1
: