Target
Pro-cathepsin H
Ligand
BDBM50152524
Substrate
Meas. Tech.
ChEMBL_306357 (CHEMBL828234)
IC50
>500±n/a nM
Citation
 Barrett, DGCatalano, JGDeaton, DNHassell, AMLong, STMiller, ABMiller, LRShewchuk, LMWells-Knecht, KJWillard, DHWright, LL Potent and selective P2-P3 ketoamide inhibitors of cathepsin K with good pharmacokinetic properties via favorable P1', P1, and/or P3 substitutions. Bioorg Med Chem Lett 14:4897-902 (2004)  
Target
Name:
Pro-cathepsin H
Synonyms:
CATH_HUMAN CPSB Cathepsin H Cathepsin H light chain | Cathepsin H mini chain
Type:
PROTEIN
Mol. Mass.:
37402.31
Organism:
Homo sapiens (Human)
Description:
ChEMBL_1459870
Residue:
335
  
Inhibitor
Name:
BDBM50152524
Synonyms:
(S)-(1-(4-fluorobenzyl)cyclobutyl)methyl 1-(1H-pyrazol-5-ylamino)-1,2-dioxoheptan-3-ylcarbamate [(S)-1-(2H-Pyrazol-3-ylaminooxalyl)-pentyl]-carbamic acid 1-(4-fluoro-benzyl)-cyclobutylmethyl ester | [1-(4-FLUOROBENZYL)CYCLOBUTYL]METHYL (1S)-1-[OXO(1H-PYRAZOL-5-YLAMINO)ACETYL]PENTYLCARBAMATE
Type:
Small organic molecule
Emp. Form.:
C23H29FN4O4
Mol. Mass.:
444.4992
SMILES:
CCCC[C@H](NC(=O)OCC1(Cc2ccc(F)cc2)CCC1)C(=O)C(=O)Nc1ccn[nH]1
: