Target
Disintegrin and metalloproteinase domain-containing protein 17
Ligand
BDBM50152901
Substrate
Meas. Tech.
ChEMBL_305667 (CHEMBL827936)
IC50
<1±n/a nM
Citation
 Xue, CBChen, XTHe, XRoderick, JCorbett, RLGhavimi, BLiu, RQCovington, MBQian, MRibadeneira, MDVaddi, KTrzaskos, JNewton, RCDuan, JJDecicco, CP Synthesis and structure-activity relationship of a novel sulfone series of TNF-alpha converting enzyme inhibitors. Bioorg Med Chem Lett 14:4453-9 (2004)  
Target
Name:
Disintegrin and metalloproteinase domain-containing protein 17
Synonyms:
A disintegrin and metalloproteinase domain 17 ADAM 17 Snake venom-like protease TNF-alpha-Converting Enzyme
Type:
Metalloprotease
Mol. Mass.:
12197.99
Organism:
Sus scrofa (pig)
Description:
Partially purified TACE was obtained from porcine spleen.
Residue:
112
  
Inhibitor
Name:
BDBM50152901
Synonyms:
1-Methyl-2-[4-(2-methyl-quinolin-4-ylmethoxy)-benzenesulfonylmethyl]-pyrrolidine-3-carboxylic acid hydroxyamide N-hydroxy-1-methyl-2-((4-((2-methylquinolin-4-yl)methoxy)phenylsulfonyl)methyl)pyrrolidine-3-carboxamide
Type:
Small organic molecule
Emp. Form.:
C24H27N3O5S
Mol. Mass.:
469.553
SMILES:
CN1CCC(C1CS(=O)(=O)c1ccc(OCc2cc(C)nc3ccccc23)cc1)C(=O)NO
: