Target
Cathepsin B
Ligand
BDBM50153291
Substrate
Meas. Tech.
ChEMBL_302543 (CHEMBL827394)
Ki
440000±n/a nM
Citation
 Chircorian, ABarrios, AM Inhibition of lysosomal cysteine proteases by chrysotherapeutic compounds: a possible mechanism for the antiarthritic activity of Au(I). Bioorg Med Chem Lett 14:5113-6 (2004)  
Target
Name:
Cathepsin B
Synonyms:
APP secretase CATB_HUMAN CTSB Cathepsin B light chain | Cathepsin B1
Type:
Enzyme
Mol. Mass.:
37819.69
Organism:
Homo sapiens (Human)
Description:
gi_63102437
Residue:
339
  
Inhibitor
Name:
BDBM50153291
Synonyms:
(1-Thio-beta-D-glucopyranosato)(triethylphosphine)gold2,3,4,6-tetraacetate CHEMBL1366 SK&F-39162 | SK-39162
Type:
Small organic molecule
Emp. Form.:
C20H34AuO9PS
Mol. Mass.:
678.484
SMILES:
CC[P+](CC)(CC)[Au-]S[C@@H]1O[C@H](COC(C)=O)[C@@H](OC(C)=O)[C@H](OC(C)=O)[C@H]1OC(C)=O
: