Target
Mu-type opioid receptor
Ligand
BDBM50017698
Substrate
Meas. Tech.
ChEMBL_303543 (CHEMBL839748)
Ki
0.53±n/a nM
Citation
 Chen, ZDavies, EMiller, WSShan, SValenzano, KJKyle, DJ Design and synthesis of 4-phenyl piperidine compounds targeting the mu receptor. Bioorg Med Chem Lett 14:5275-9 (2004)  
Target
Name:
Mu-type opioid receptor
Synonyms:
M-OR-1 MOR-1 MUOR1 Mu opiate receptor OPRM1 hMOP | mu-type opioid receptor isoform MOR-1
Type:
G Protein-Coupled Receptor (GPCR)
Mol. Mass.:
44789.51
Organism:
Homo sapiens (Human)
Description:
P35372
Residue:
400
  
Inhibitor
Name:
BDBM50017698
Synonyms:
4-(4-(4-chlorophenyl)-4-hydroxypiperidin-1-yl)-N,N-dimethyl-2,2-diphenylbutanamide 4-[4-(4-Chloro-phenyl)-4-hydroxy-piperidin-1-yl]-N,N-dimethyl-2,2-diphenyl-butyramide(loperamide) Imodium LOPERAMIDE HYDROCHLORIDE med.21724, Compound 184
Type:
Small organic molecule
Emp. Form.:
C29H33ClN2O2
Mol. Mass.:
477.038
SMILES:
CN(C)C(=O)C(CCN1CCC(O)(CC1)c1ccc(Cl)cc1)(c1ccccc1)c1ccccc1
: