Target
Carbonic anhydrase 4
Ligand
BDBM26987
Substrate
Meas. Tech.
ChEMBL_302637 (CHEMBL839928)
Ki
5700000±n/a nM
Citation
 Rusconi, SInnocenti, AVullo, DMastrolorenzo, AScozzafava, ASupuran, CT Carbonic anhydrase inhibitors. Interaction of isozymes I, II, IV, V, and IX with phosphates, carbamoyl phosphate, and the phosphonate antiviral drug foscarnet. Bioorg Med Chem Lett 14:5763-7 (2004)  
Target
Name:
Carbonic anhydrase 4
Synonyms:
CA-IV CAH4_HUMAN Carbonic anhydrase Carbonic anhydrase IV (CA IV)
Type:
Enzyme
Mol. Mass.:
35037.98
Organism:
Homo sapiens (Human)
Description:
P22748
Residue:
312
  
Inhibitor
Name:
BDBM26987
Synonyms:
CHEMBL180485 SODIUM CARBONATE carbonate ion
Type:
Ion
Emp. Form.:
CO3
Mol. Mass.:
60.01
SMILES:
[O-]C([O-])=O
: