Target
Beta-lactamase
Ligand
BDBM50157692
Substrate
Meas. Tech.
ChEMBL_430086 (CHEMBL918107)
IC50
84000±n/a nM
Citation
 Venkatesan, AMGu, YDos Santos, OAbe, TAgarwal, AYang, YPetersen, PJWeiss, WJMansour, TSNukaga, MHujer, AMBonomo, RAKnox, JR Structure-activity relationship of 6-methylidene penems bearing tricyclic heterocycles as broad-spectrum beta-lactamase inhibitors: crystallographic structures show unexpected binding of 1,4-thiazepine intermediates. J Med Chem 47:6556-68 (2004)  
Target
Name:
Beta-lactamase
Synonyms:
AMPC_ENTCL | ampC
Type:
PROTEIN
Mol. Mass.:
41306.67
Organism:
Enterobacter cloacae
Description:
ChEMBL_40258
Residue:
381
  
Inhibitor
Name:
BDBM50157692
Synonyms:
CHEMBL1439 Sodium; (2S,3S,5R)-3-methyl-4,4,7-trioxo-3-[1,2,3]triazol-1-ylmethyl-4lambda*6*-thia-1-aza-bicyclo[3.2.0]heptane-2-carboxylate US9035062, TAZ tazobactum
Type:
Small organic molecule
Emp. Form.:
C10H11N4NaO5S
Mol. Mass.:
322.273
SMILES:
C[C@]1(Cn2ccnn2)[C@@H](N2[C@@H](CC2=O)S1(=O)=O)C(=O)O[Na]
: