Target
Retinoic acid receptor alpha
Ligand
BDBM50158413
Substrate
Meas. Tech.
ChEMBL_430404 (CHEMBL916388)
IC50
20000±n/a nM
Citation
 Patel, JBHuynh, CKHandratta, VDGediya, LKBrodie, AMGoloubeva, OGClement, OONanne, IPSoprano, DRNjar, VC Novel retinoic acid metabolism blocking agents endowed with multiple biological activities are efficient growth inhibitors of human breast and prostate cancer cells in vitro and a human breast tumor xenograft in nude mice. J Med Chem 47:6716-29 (2004)  
Target
Name:
Retinoic acid receptor alpha
Synonyms:
NR1B1 RAR-alpha RARA_HUMAN Retinoic acid receptor alpha/Retinoid X receptor alpha Retinoid receptor
Type:
PROTEIN
Mol. Mass.:
50778.87
Organism:
Homo sapiens (Human)
Description:
ChEMBL_1466191
Residue:
462
  
Inhibitor
Name:
BDBM50158413
Synonyms:
CHEMBL388283 | N-(1H-1,2,4-triazol-1-yl)-(E)-retinamide
Type:
Small organic molecule
Emp. Form.:
C22H29N3O
Mol. Mass.:
351.4852
SMILES:
C\C(\C=C\C1=C(C)CCCC1(C)C)=C/C=CC(C)=CC(=O)n1cncn1
: