Target
Dihydrofolate reductase
Ligand
BDBM50158569
Substrate
Meas. Tech.
ChEMBL_430663 (CHEMBL919631)
Ki
0.034±n/a nM
Citation
 Rosowsky, AForsch, RAWright, JE Synthesis and in vitro antifolate activity of rotationally restricted aminopterin and methotrexate analogues. J Med Chem 47:6958-63 (2004)  
Target
Name:
Dihydrofolate reductase
Synonyms:
DHFR Dihydrofolate reductase (DHFR) | Tetrahydrofolate dehydrogenase
Type:
Enzyme
Mol. Mass.:
21453.99
Organism:
Homo sapiens (Human)
Description:
Recombinant human DHFR.
Residue:
187
  
Inhibitor
Name:
BDBM50158569
Synonyms:
2-S-[5-[2,4-diaminopteridin-6-yl)methyamino]-2,3-dihydro-1-oxo--2(1H)-isoindolyl glutaric acid | CHEMBL390990
Type:
Small organic molecule
Emp. Form.:
C20H20N8O5
Mol. Mass.:
452.4234
SMILES:
Nc1nc(N)c2nc(CNc3ccc4C(=O)N(Cc4c3)[C@@H](CCC(O)=O)C(O)=O)cnc2n1
: