Target
Pro-cathepsin H
Ligand
BDBM50165426
Substrate
Meas. Tech.
ChEMBL_306657 (CHEMBL831430)
IC50
>13000±n/a nM
Citation
 Barrett, DGCatalano, JGDeaton, DNLong, STMcFadyen, RBMiller, ABMiller, LRWells-Knecht, KJWright, LL A structural screening approach to ketoamide-based inhibitors of cathepsin K. Bioorg Med Chem Lett 15:2209-13 (2005)  
Target
Name:
Pro-cathepsin H
Synonyms:
CATH_HUMAN CPSB Cathepsin H Cathepsin H light chain | Cathepsin H mini chain
Type:
PROTEIN
Mol. Mass.:
37402.31
Organism:
Homo sapiens (Human)
Description:
ChEMBL_1459870
Residue:
335
  
Inhibitor
Name:
BDBM50165426
Synonyms:
CHEMBL196298 | [(S)-1-((R)-1-Phenyl-ethylaminooxalyl)-pentyl]-carbamic acid bicyclo[2.2.1]hept-2-yl ester
Type:
Small organic molecule
Emp. Form.:
C23H32N2O4
Mol. Mass.:
400.5112
SMILES:
CCCC[C@H](NC(=O)OC1CC2CCC1C2)C(=O)C(=O)N[C@H](C)c1ccccc1
: