Target
Melanocortin receptor 4
Ligand
BDBM50165930
Substrate
Meas. Tech.
ChEMBL_302520 (CHEMBL827373)
Ki
0.520000±n/a nM
Citation
 Mayer, JPHsiung, HMFlora, DBEdwards, PSmith, DPZhang, XYGadski, RAHeiman, MLHertel, JLEmmerson, PJHusain, SO'brien, TPKahl, SDSmiley, DLZhang, LDimarchi, RDYan, LZ Discovery of a beta-MSH-derived MC-4R selective agonist. J Med Chem 48:3095-8 (2005)  
Target
Name:
Melanocortin receptor 4
Synonyms:
MC4-R Mc4r
Type:
PROTEIN
Mol. Mass.:
36892.87
Organism:
Rattus norvegicus
Description:
ChEMBL_11005
Residue:
332
  
Inhibitor
Name:
BDBM50165930
Synonyms:
Ac-YR[CEHdFRWC]-NH2 | CHEMBL264352
Type:
Small organic molecule
Emp. Form.:
C60H79N19O13S2
Mol. Mass.:
1338.519
SMILES:
CC(=O)N[C@@H](Cc1ccc(O)cc1)C(=O)N[C@@H](CCCNC(N)=N)C(=O)N[C@@H]1CSSC[C@@H](NC(=O)[C@@H](Cc2c[nH]c3ccccc23)NC(=O)[C@H](CCCNC(N)=N)NC(=O)[C@H](Cc2ccccc2)NC(=O)[C@H](Cc2cnc[nH]2)NC(=O)[C@@H](CCC(O)=O)NC1=O)C(N)=O
: