Target
Adenosine receptor A2a
Ligand
BDBM50173176
Substrate
Meas. Tech.
ChEMBL_320973 (CHEMBL885380)
Ki
1±n/a nM
Citation
 Dowling, JEVessels, JTHaque, SChang, HXvan Vloten, KKumaravel, GEngber, TJin, XPhadke, DWang, JAyyub, EPetter, RC Synthesis of [1,2,4]triazolo[1,5-a]pyrazines as adenosine A2A receptor antagonists. Bioorg Med Chem Lett 15:4809-13 (2005)  
Target
Name:
Adenosine receptor A2a
Synonyms:
AA2AR_RAT Adenosine A2 receptor Adenosine Receptors A2a (A2a) Adenosine receptors A2a Rat striatal adenosine A2a receptor
Type:
G Protein-Coupled Receptor (GPCR)
Mol. Mass.:
45015.65
Organism:
Rattus norvegicus (rat)
Description:
Rat A2A receptors expressed in CHO cells.
Residue:
410
  
Inhibitor
Name:
BDBM50173176
Synonyms:
8-Amino-2-furan-2-yl-[1,2,4]triazolo[1,5-a]pyrazine-6-carboxylic acid [2-(4-hydroxy-phenyl)-ethyl]-amide N-(4-hydroxyphenethyl)-8-amino-2-(furan-2-yl)-[1,2,4]triazolo[1,5-a]pyrazine-6-carboxamide
Type:
Small organic molecule
Emp. Form.:
C18H16N6O3
Mol. Mass.:
364.358
SMILES:
Nc1nc(cn2nc(nc12)-c1ccco1)C(=O)NCCc1ccc(O)cc1
: