Target
Dipeptidyl peptidase 4
Ligand
BDBM50173973
Substrate
Meas. Tech.
ChEMBL_328423 (CHEMBL863964)
Ki
225±n/a nM
Citation
 Haffner, CDMcDougald, DLReister, SMThompson, BDConlee, CFang, JBass, JLenhard, JMCroom, DSecosky-Chang, MBTomaszek, TMcConn, DWells-Knecht, KJohnson, PR 2-Cyano-4-fluoro-1-thiovalylpyrrolidine analogues as potent inhibitors of DPP-IV. Bioorg Med Chem Lett 15:5257-61 (2005)  
Target
Name:
Dipeptidyl peptidase 4
Synonyms:
ADABP Adenosine deaminase complexing protein 2 CD_antigen=CD26 DPP4 DPPIV Dipeptidyl peptidase 4 (DPP IV) Dipeptidyl peptidase 4 (DPP4) Dipeptidyl peptidase 4 membrane form Dipeptidyl peptidase IV Dipeptidyl peptidase IV (DDP-IV) Dipeptidyl peptidase IV membrane form Dipeptidyl peptidase-IV (DPP-4) T-cell activation antigen CD26 | TP103
Type:
Enzyme
Mol. Mass.:
88271.01
Organism:
Homo sapiens (Human)
Description:
P27487
Residue:
766
  
Inhibitor
Name:
BDBM50173973
Synonyms:
CHEMBL201053 | N-(4-(((R)-3-amino-4-((2S,4S)-2-cyano-4-fluoropyrrolidin-1-yl)-2-methyl-4-oxobutan-2-ylsulfonyl)methyl)phenyl)acetamide
Type:
Small organic molecule
Emp. Form.:
C19H25FN4O4S
Mol. Mass.:
424.49
SMILES:
CC(=O)Nc1ccc(CS(=O)(=O)C(C)(C)[C@H](N)C(=O)N2C[C@@H](F)C[C@H]2C#N)cc1
: