Target
Dipeptidyl peptidase 4
Ligand
BDBM50173984
Substrate
Meas. Tech.
ChEMBL_328423 (CHEMBL863964)
Ki
310±n/a nM
Citation
 Haffner, CDMcDougald, DLReister, SMThompson, BDConlee, CFang, JBass, JLenhard, JMCroom, DSecosky-Chang, MBTomaszek, TMcConn, DWells-Knecht, KJohnson, PR 2-Cyano-4-fluoro-1-thiovalylpyrrolidine analogues as potent inhibitors of DPP-IV. Bioorg Med Chem Lett 15:5257-61 (2005)  
Target
Name:
Dipeptidyl peptidase 4
Synonyms:
ADABP Adenosine deaminase complexing protein 2 CD_antigen=CD26 DPP4 DPPIV Dipeptidyl peptidase 4 (DPP IV) Dipeptidyl peptidase 4 (DPP4) Dipeptidyl peptidase 4 membrane form Dipeptidyl peptidase IV Dipeptidyl peptidase IV (DDP-IV) Dipeptidyl peptidase IV membrane form Dipeptidyl peptidase-IV (DPP-4) T-cell activation antigen CD26 | TP103
Type:
Enzyme
Mol. Mass.:
88271.01
Organism:
Homo sapiens (Human)
Description:
P27487
Residue:
766
  
Inhibitor
Name:
BDBM50173984
Synonyms:
(2S,4S)-1-((R)-3-(3-phenoxybenzylsulfonyl)-2-amino-3-methylbutanoyl)-4-fluoropyrrolidine-2-carbonitrile | CHEMBL369950
Type:
Small organic molecule
Emp. Form.:
C23H26FN3O4S
Mol. Mass.:
459.534
SMILES:
CC(C)([C@H](N)C(=O)N1C[C@@H](F)C[C@H]1C#N)S(=O)(=O)Cc1cccc(Oc2ccccc2)c1
: