Target
11-beta-hydroxysteroid dehydrogenase 1
Ligand
BDBM50174284
Substrate
Meas. Tech.
ChEMBL_326694 (CHEMBL868713)
IC50
1.8±n/a nM
Citation
 Gu, XDragovic, JKoo, GCKoprak, SLLeGrand, CMundt, SSShah, KSpringer, MSTan, EYThieringer, RHermanowski-Vosatka, AZokian, HJBalkovec, JMWaddell, ST Discovery of 4-heteroarylbicyclo[2.2.2]octyltriazoles as potent and selective inhibitors of 11beta-HSD1: novel therapeutic agents for the treatment of metabolic syndrome. Bioorg Med Chem Lett 15:5266-9 (2005)  
Target
Name:
11-beta-hydroxysteroid dehydrogenase 1
Synonyms:
11-DH 11-beta-Hydroxysteroid Dehydrogenase 1 (11-beta-HSD1) 11beta-HSD1A Corticosteroid 11-beta-dehydrogenase isozyme 1 (11-beta-HSD-1) Hsd11 | Hsd11b1
Type:
Enzyme
Mol. Mass.:
32369.70
Organism:
Mus musculus (mouse)
Description:
P50172
Residue:
292
  
Inhibitor
Name:
BDBM50174284
Synonyms:
4-methyl-3-(4-(3-(4-(methylsulfonyl)phenyl)-1,2,4-oxadiazol-5-yl)bicyclo[2.2.2]octan-1-yl)-5-(2-(trifluoromethyl)phenyl)-4H-1,2,4-triazole | CHEMBL197220
Type:
Small organic molecule
Emp. Form.:
C27H26F3N5O3S
Mol. Mass.:
557.587
SMILES:
Cn1c(nnc1C12CCC(CC1)(CC2)c1nc(no1)-c1ccc(cc1)S(C)(=O)=O)-c1ccccc1C(F)(F)F
: