Target
Integrase
Ligand
BDBM23402
Substrate
Meas. Tech.
ChEMBL_321433 (CHEMBL880241)
IC50
0.500000±n/a nM
Citation
 Barreca, MLFerro, SRao, ADe Luca, LZappalà, MMonforte, AMDebyser, ZWitvrouw, MChimirri, A Pharmacophore-based design of HIV-1 integrase strand-transfer inhibitors. J Med Chem 48:7084-8 (2005)  
Target
Name:
Integrase
Synonyms:
Human immunodeficiency virus type 1 integrase
Type:
PROTEIN
Mol. Mass.:
32231.48
Organism:
Human immunodeficiency virus 1
Description:
ChEMBL_90865
Residue:
288
  
Inhibitor
Name:
BDBM23402
Synonyms:
5-(1,1-dioxo-1,2-thiazinan-2-yl)-N-[(4-fluorophenyl)methyl]-8-hydroxy-1,6-naphthyridine-7-carboxamide L-870,810
Type:
Small organic molecule
Emp. Form.:
C20H19FN4O4S
Mol. Mass.:
430.453
SMILES:
Oc1c(nc(N2CCCCS2(=O)=O)c2cccnc12)C(=O)NCc1ccc(F)cc1
: