Target
Metabotropic glutamate receptor 5
Ligand
BDBM86716
Substrate
Meas. Tech.
ChEMBL_335665 (CHEMBL860565)
IC50
460±n/a nM
Citation
 Wållberg, ANilsson, KOsterlund, KPeterson, AElg, SRaboisson, PBauer, UHammerland, LGMattsson, JP Phenyl ureas of creatinine as mGluR5 antagonists. A structure-activity relationship study of fenobam analogues. Bioorg Med Chem Lett 16:1142-5 (2006)  
Target
Name:
Metabotropic glutamate receptor 5
Synonyms:
GRM5_RAT Grm5 Mglur5 metabotropic glutamate 5/1-C metabotropic glutamate 5a
Type:
Enzyme
Mol. Mass.:
131900.14
Organism:
Rattus norvegicus (Rat)
Description:
P31424
Residue:
1203
  
Inhibitor
Name:
BDBM86716
Synonyms:
CAS_63540-28-3 Fenobam | NSC_216215
Type:
Small organic molecule
Emp. Form.:
C11H11ClN4O2
Mol. Mass.:
266.684
SMILES:
Cn1cc(O)nc1NC(=O)Nc1cccc(Cl)c1
: