Target
Polyprenyl synthetase family protein
Ligand
BDBM12576
Substrate
Meas. Tech.
ChEMBL_330072 (CHEMBL858875)
IC50
170±n/a nM
Citation
 Hudock, MPSanz-Rodríguez, CESong, YChan, JMZhang, YOdeh, SKosztowski, TLeon-Rossell, AConcepción, JLYardley, VCroft, SLUrbina, JAOldfield, E Inhibition of Trypanosoma cruzi hexokinase by bisphosphonates. J Med Chem 49:215-23 (2006)  
Target
Name:
Polyprenyl synthetase family protein
Synonyms:
Farnesyl diphosphate synthase | Farnesyl pyrophosphate synthase
Type:
PROTEIN
Mol. Mass.:
41078.35
Organism:
Plasmodium falciparum (isolate 3D7)
Description:
ChEMBL_330072
Residue:
362
  
Inhibitor
Name:
BDBM12576
Synonyms:
Bisphosphonate 1 JMC515594 Compound 64 Risdronate [1-hydroxy-1-phosphono-2-(pyridin-3-yl)ethyl]phosphonic acid
Type:
Small organic molecule
Emp. Form.:
C7H11NO7P2
Mol. Mass.:
283.1123
SMILES:
OC(Cc1cccnc1)(P(O)(O)=O)P(O)(O)=O
: