Target
1-deoxy-D-xylulose 5-phosphate reductoisomerase
Ligand
BDBM50181153
Substrate
Meas. Tech.
ChEMBL_345851 (CHEMBL860877)
IC50
30±n/a nM
Citation
 Haemers, TWiesner, JVan Poecke, SGoeman, JHenschker, DBeck, EJomaa, HVan Calenbergh, S Synthesis of alpha-substituted fosmidomycin analogues as highly potent Plasmodium falciparum growth inhibitors. Bioorg Med Chem Lett 16:1888-91 (2006)  
Target
Name:
1-deoxy-D-xylulose 5-phosphate reductoisomerase
Synonyms:
1-Deoxy-D-xylulose 5-phosphate reductoisomerase (DXP) 1-deoxy-D-xylulose 5-phosphate reductoisomerase (DXR) DXP reductoisomerase dxr yaeM
Type:
Protein
Mol. Mass.:
43384.52
Organism:
Escherichia coli
Description:
P45568
Residue:
398
  
Inhibitor
Name:
BDBM50181153
Synonyms:
3-(N-hydroxyacetamido)propylphosphonic acid CHEMBL205338 ammonium 3-(N-hydroxyacetamido)propylphosphonate
Type:
Small organic molecule
Emp. Form.:
C5H12NO5P
Mol. Mass.:
197.1262
SMILES:
CC(=O)N(O)CCCP(O)(O)=O
: