Target
Sodium-dependent serotonin transporter
Ligand
BDBM50139957
Substrate
Meas. Tech.
ChEMBL_330473 (CHEMBL869979)
Ki
0.04±n/a nM
Citation
 Plisson, CJarkas, NMcConathy, JVoll, RJVotaw, JWilliams, LHowell, LLKilts, CDGoodman, MM Evaluation of carbon-11-labeled 2beta-carbomethoxy-3beta-[4'-((Z)-2-iodoethenyl)phenyl]nortropane as a potential radioligand for imaging the serotonin transporter by PET. J Med Chem 49:942-6 (2006)  
Target
Name:
Sodium-dependent serotonin transporter
Synonyms:
5-HT Transporter 5HTT SC6A4_HUMAN SLC6A4 Serotonin transporter (5HTT) Sodium-dependent serotonin transporter (SERT) | Solute carrier family 6 member 4
Type:
Multi-pass membrane protein
Mol. Mass.:
70322.51
Organism:
Homo sapiens (Human)
Description:
P31645
Residue:
630
  
Inhibitor
Name:
BDBM50139957
Synonyms:
2beta-carbomethoxy-3beta-[4'-((Z)-2-iodoethenyl)phenyl]nortropane CHEMBL428706
Type:
Small organic molecule
Emp. Form.:
C17H20INO2
Mol. Mass.:
397.2507
SMILES:
COC(=O)C1C2CCC(CC1c1ccc(\C=C/I)cc1)N2
: