Target
Metabotropic glutamate receptor 5
Ligand
BDBM50182814
Substrate
Meas. Tech.
ChEMBL_348518 (CHEMBL865700)
IC50
1250±n/a nM
Citation
 Hammerland, LGJohansson, MMalmström, JMattsson, JPMinidis, ABNilsson, KPeterson, AWensbo, DWållberg, AOsterlund, K Structure-activity relationship of thiopyrimidines as mGluR5 antagonists. Bioorg Med Chem Lett 16:2467-9 (2006)  
Target
Name:
Metabotropic glutamate receptor 5
Synonyms:
GPRC1E GRM5_HUMAN metabotropic glutamate 5 | metabotropic glutamate 5a
Type:
Enzyme
Mol. Mass.:
132484.72
Organism:
Homo sapiens (Human)
Description:
Residue:
1212
  
Inhibitor
Name:
BDBM50182814
Synonyms:
4-(4-chlorophenylthio)-6-methyl-2-(pyridin-2-yl)pyrimidine | CHEMBL207744
Type:
Small organic molecule
Emp. Form.:
C16H12ClN3S
Mol. Mass.:
313.805
SMILES:
Cc1cc(Sc2ccc(Cl)cc2)nc(n1)-c1ccccn1
: