Target
Alpha-1D adrenergic receptor
Ligand
BDBM50186613
Substrate
Meas. Tech.
ChEMBL_353199 (CHEMBL865719)
EC50
6300±n/a nM
Citation
 Boschi, DTron, GCLazzarato, LChegaev, KCena, CDi Stilo, AGiorgis, MBertinaria, MFruttero, RGasco, A NO-donor phenols: a new class of products endowed with antioxidant and vasodilator properties. J Med Chem 49:2886-97 (2006)  
Target
Name:
Alpha-1D adrenergic receptor
Synonyms:
ADA1D_RAT Adra1d Alpha-1D adrenergic receptor | Serotonin 1a (5-HT1a) receptor/Adrenergic receptor alpha-1
Type:
Protein
Mol. Mass.:
59375.97
Organism:
Rattus norvegicus (Rat)
Description:
P23944
Residue:
561
  
Inhibitor
Name:
BDBM50186613
Synonyms:
4-hydroxymethyl-2-oxy-furazan-3-carboxylic acid amide CHEMBL206100
Type:
Small organic molecule
Emp. Form.:
C4H5N3O4
Mol. Mass.:
159.1002
SMILES:
NC(=O)c1c(CO)no[n+]1[O-]
: