Target
Estrogen receptor beta
Ligand
BDBM50187962
Substrate
Meas. Tech.
ChEMBL_383639 (CHEMBL868002)
IC50
5.2±n/a nM
Citation
 Wilkening, RRRatcliffe, RWFried, AKMeng, DSun, WColwell, LLambert, SGreenlee, MNilsson, SThorsell, AMojena, MTudela, CFrisch, KChan, WBirzin, ETRohrer, SPHammond, ML Estrogen receptor beta-subtype selective tetrahydrofluorenones: use of a fused pyrazole as a phenol bioisostere. Bioorg Med Chem Lett 16:3896-901 (2006)  
Target
Name:
Estrogen receptor beta
Synonyms:
ER-beta ESR2_HUMAN Estradiol receptor beta (ERβ) Estrogen receptor (ER beta) Estrogen receptor beta (ER beta) NR3A2 estrogen beta
Type:
Protein
Mol. Mass.:
59238.43
Organism:
Homo sapiens (Human)
Description:
Q92731
Residue:
530
  
Inhibitor
Name:
BDBM50187962
Synonyms:
(S)-methyl 9a-butyl-7-oxo-3,7,8,9,9a,10-hexahydroindeno[2,1-e]indazole-6-carboxylate | CHEMBL377988
Type:
Small organic molecule
Emp. Form.:
C20H22N2O3
Mol. Mass.:
338.4003
SMILES:
CCCC[C@]12Cc3c(ccc4[nH]ncc34)C1=C(C(=O)OC)C(=O)CC2
: