Target
Prostaglandin G/H synthase 1
Ligand
BDBM50189988
Substrate
Meas. Tech.
ChEMBL_391093 (CHEMBL869872)
IC50
3.8±n/a nM
Citation
 Navidpour, LAmini, MShafaroodi, HAbdi, KGhahremani, MHDehpour, ARShafiee, A Design and synthesis of new water-soluble tetrazolide derivatives of celecoxib and rofecoxib as selective cyclooxygenase-2 (COX-2) inhibitors. Bioorg Med Chem Lett 16:4483-7 (2006)  
Target
Name:
Prostaglandin G/H synthase 1
Synonyms:
COX1 Cyclooxygenase-1 (COX-1) PTGS1 | Prostaglandin G/H synthase (cyclooxygenase)
Type:
Protein
Mol. Mass.:
68868.60
Organism:
Ovis aries (Sheep)
Description:
Residue:
600
  
Inhibitor
Name:
BDBM50189988
Synonyms:
CHEMBL214101 | Rofecoxib analogue
Type:
Small organic molecule
Emp. Form.:
C17H12N4O2
Mol. Mass.:
304.3028
SMILES:
O=C1OCC(=C1c1ccccc1)c1ccc(cc1)-c1nnn[nH]1
: