Target
5-hydroxytryptamine receptor 2B
Ligand
BDBM50191181
Substrate
Meas. Tech.
ChEMBL_399082 (CHEMBL909200)
IC50
26±n/a nM
Citation
 Bienaymé, HChêne, LGrisoni, SGrondin, AKaloun, el-BPoigny, SRahali, HTam, E New spiro-piperidines as 5-HT2B receptor antagonists. Bioorg Med Chem Lett 16:4830-3 (2006)  
Target
Name:
5-hydroxytryptamine receptor 2B
Synonyms:
5-HT-2B 5-hydroxytryptamine (serotonin) receptor 2B [Homo sapiens] 5-hydroxytryptamine receptor 2C (5HT2C) HTR2B Serotonin 2b (5-HT2b) receptor | Serotonin Receptor 2B
Type:
G Protein-Coupled Receptor (GPCR)
Mol. Mass.:
54312.47
Organism:
Homo sapiens (Human)
Description:
Receptor binding assays were performed using human clone stably expressed in CHO cells.
Residue:
481
  
Inhibitor
Name:
BDBM50191181
Synonyms:
12'-fluoro-4'-(4-fluorophenyl)-1-propyl-8'-oxa-5',6'-diazaspiro[piperidine-4,7'-tricyclo[7.4.0.0^{2,6}]tridecane]-1'(13'),4',9',11'-tetraene | CHEMBL376978
Type:
Small organic molecule
Emp. Form.:
C23H25F2N3O
Mol. Mass.:
397.4609
SMILES:
CCCN1CCC2(CC1)Oc1ccc(F)cc1C1CC(=NN21)c1ccc(F)cc1
: