Target
Kappa-type opioid receptor
Ligand
BDBM50159170
Substrate
Meas. Tech.
ChEMBL_424357 (CHEMBL909560)
Ki
43.4±n/a nM
Citation
 Lee, DYHe, MLiu-Chen, LYWang, YLi, JGXu, WMa, ZCarlezon, WACohen, B Synthesis and in vitro pharmacological studies of new C(4)-modified salvinorin A analogues. Bioorg Med Chem Lett 16:5498-502 (2006)  
Target
Name:
Kappa-type opioid receptor
Synonyms:
K-OR-1 Kappa-opioid receptor (KOR) Kappa-type opioid receptor (KOR) OPIATE Kappa OPRK1 kappa opioid receptor (KOR)
Type:
G Protein-Coupled Receptor (GPCR)
Mol. Mass.:
42648.76
Organism:
Homo sapiens (Human)
Description:
P41145
Residue:
380
  
Inhibitor
Name:
BDBM50159170
Synonyms:
(2S,4aR,6aS,7R,9S,10aS,10bR)-2-(furan-3-yl)-7-(hydroxymethyl)-6a,10b-dimethyl-4,10-dioxo-dodecahydro-1H-benzo[f]isochromen-9-yl acetate CHEMBL425016
Type:
Small organic molecule
Emp. Form.:
C22H28O7
Mol. Mass.:
404.4535
SMILES:
CC(=O)O[C@H]1C[C@@H](CO)[C@]2(C)CC[C@H]3C(=O)O[C@@H](C[C@]3(C)[C@H]2C1=O)c1ccoc1
: