Target
Potassium voltage-gated channel subfamily H member 2
Ligand
BDBM50194557
Substrate
Meas. Tech.
ChEMBL_424425 (CHEMBL910704)
Ki
510±n/a nM
Citation
 Elliott, JMCarling, RWChicchi, GGCrawforth, JHutson, PHJones, ABKelly, SMarwood, RMeneses-Lorente, GMezzogori, EMurray, FRigby, MRoyo, IRussell, MGShaw, DSohal, BTsao, KLWilliams, B N',2-diphenylquinoline-4-carbohydrazide based NK3 receptor antagonists II. Bioorg Med Chem Lett 16:5752-6 (2006)  
Target
Name:
Potassium voltage-gated channel subfamily H member 2
Synonyms:
1,3-beta-glucan synthase component GLS2 ERG Eag-related protein 1 Ether-a-go-go-related gene (HERG) Ether-a-go-go-related gene potassium channel 1 Ether-a-go-go-related gene potassium channel 1 (hERG1) Ether-a-go-go-related protein 1 H-ERG KCNH2 Potassium voltage-gated channel subfamily H member 2 (hERG) Voltage-gated potassium channel subunit Kv11.1 hERG Potassium Channel 1 | putative potassium channel subunit
Type:
Multi-pass membrane protein
Mol. Mass.:
126672.65
Organism:
Homo sapiens (Human)
Description:
Q12809
Residue:
1159
  
Inhibitor
Name:
BDBM50194557
Synonyms:
CHEMBL221238 | N-phenyl-N'-{2-phenyl-3-[4-(tetrahydro-thiopyran-4-yl)-piperazin-1-ylmethyl]-quinoline-4-carbonyl}-hydrazinecarboxylic acid methyl ester
Type:
Small organic molecule
Emp. Form.:
C34H37N5O3S
Mol. Mass.:
595.754
SMILES:
COC(=O)N(NC(=O)c1c(CN2CCN(CC2)C2CCSCC2)c(nc2ccccc12)-c1ccccc1)c1ccccc1
: