Target
Tyrosine-protein kinase Lck
Ligand
BDBM35317
Substrate
Meas. Tech.
ChEMBL_396621 (CHEMBL913225)
IC50
0.300000±n/a nM
Citation
 DiMauro, EFNewcomb, JNunes, JJBemis, JEBoucher, CBuchanan, JLBuckner, WHCee, VJChai, LDeak, HLEpstein, LFFaust, TGallant, PGeuns-Meyer, SDGore, AGu, YHenkle, BHodous, BLHsieh, FHuang, XKim, JLLee, JHMartin, MWMasse, CEMcGowan, DCMetz, DMohn, DMorgenstern, KAOliveira-dos-Santos, APatel, VFPowers, DRose, PESchneider, STomlinson, SATudor, YYTurci, SMWelcher, AAWhite, RDZhao, HZhu, LZhu, X Discovery of aminoquinazolines as potent, orally bioavailable inhibitors of Lck: synthesis, SAR, and in vivo anti-inflammatory activity. J Med Chem 49:5671-86 (2006)  
Target
Name:
Tyrosine-protein kinase Lck
Synonyms:
2.7.10.2 LCK_HUMAN Leukocyte C-terminal Src kinase Lymphocyte-specific protein tyrosine kinase Protein YT16 Proto-oncogene tyrosine-protein kinase LCK T cell-specific protein-tyrosine kinase
Type:
Mol. Mass.:
57987.83
Organism:
Homo sapiens (Human)
Description:
P06239
Residue:
509
  
Inhibitor
Name:
BDBM35317
Synonyms:
4-Methyl-3-(2-(methylamino)quinazolin-6-yl)-N-(3-(trifluoromethyl)phenyl)benzamide aminoquinazoline benzamide, 3
Type:
Small organic molecule
Emp. Form.:
C24H19F3N4O
Mol. Mass.:
436.4291
SMILES:
CNc1ncc2cc(ccc2n1)-c1cc(ccc1C)C(=O)Nc1cccc(c1)C(F)(F)F
: