Target
11-beta-hydroxysteroid dehydrogenase 1
Ligand
BDBM50195299
Substrate
Meas. Tech.
ChEMBL_424847 (CHEMBL907397)
Ki
3±n/a nM
Citation
 Sorensen, BRohde, JWang, JFung, SMonzon, KChiou, WPan, LDeng, XStolarik, DFrevert, EUJacobson, PLink, JT Adamantane 11-beta-HSD-1 inhibitors: Application of an isocyanide multicomponent reaction. Bioorg Med Chem Lett 16:5958-62 (2006)  
Target
Name:
11-beta-hydroxysteroid dehydrogenase 1
Synonyms:
11-DH 11-beta-Hydroxysteroid Dehydrogenase 1 (11-beta-HSD1) 11beta-HSD1A Corticosteroid 11-beta-dehydrogenase isozyme 1 (11-beta-HSD-1) Hsd11 | Hsd11b1
Type:
Enzyme
Mol. Mass.:
32369.70
Organism:
Mus musculus (mouse)
Description:
P50172
Residue:
292
  
Inhibitor
Name:
BDBM50195299
Synonyms:
4-({1-[4-(5-trifluoromethyl-pyridin-2-yl)-piperazin-1-yl]-cyclobutanecarbonyl}-amino)-adamantane-1-carboxylic acid amide | CHEMBL222511
Type:
Small organic molecule
Emp. Form.:
C26H34F3N5O2
Mol. Mass.:
505.5757
SMILES:
NC(=O)[C@@]12CC3CC(C1)[C@H](NC(=O)C1(CCC1)N1CCN(CC1)c1ccc(cn1)C(F)(F)F)C(C3)C2
: