Target
Adenosine receptor A1
Ligand
BDBM50199968
Substrate
Meas. Tech.
ChEMBL_422429 (CHEMBL909304)
Ki
1970±n/a nM
Citation
 Cosyn, LPalaniappan, KKKim, SKDuong, HTGao, ZGJacobson, KAVan Calenbergh, S 2-triazole-substituted adenosines: a new class of selective A3 adenosine receptor agonists, partial agonists, and antagonists. J Med Chem 49:7373-83 (2006)  
Target
Name:
Adenosine receptor A1
Synonyms:
A1 adenosine receptor (hA1) AA1R_HUMAN ADORA1 Adenosine A1-receptor Adenosine receptor A1 (hA1) | Adenosine transporter (AdT)
Type:
G Protein-Coupled Receptor (GPCR)
Mol. Mass.:
36520.92
Organism:
Homo sapiens (Human)
Description:
P30542
Residue:
326
  
Inhibitor
Name:
BDBM50199968
Synonyms:
CHEMBL218326 | N6-methyl-2-[4-pyridin-2-yl-1,2,3-triazol-1-yl]-9-(beta-D-ribofuranosyl)adenine
Type:
Small organic molecule
Emp. Form.:
C18H19N9O4
Mol. Mass.:
425.4014
SMILES:
CNc1nc(nc2n(cnc12)[C@@H]1O[C@H](CO)[C@@H](O)[C@H]1O)-n1cc(nn1)-c1ccccn1
: