Target
Glucagon receptor
Ligand
BDBM50202031
Substrate
Meas. Tech.
ChEMBL_423446 (CHEMBL911099)
IC50
27±n/a nM
Citation
 Lau, JBehrens, CSidelmann, UGKnudsen, LBLundt, BSams, CYnddal, LBrand, CLPridal, LLing, AKiel, DPlewe, MShi, SMadsen, P New beta-alanine derivatives are orally available glucagon receptor antagonists. J Med Chem 50:113-28 (2007)  
Target
Name:
Glucagon receptor
Synonyms:
GCGR GLR_HUMAN Glucagon receptor (GlucR)
Type:
Enzyme
Mol. Mass.:
54026.92
Organism:
Homo sapiens (Human)
Description:
P47871
Residue:
477
  
Inhibitor
Name:
BDBM50202031
Synonyms:
3-(4-((1-(4-cyclohexenylphenyl)-3-(3,5-dichlorophenyl)ureido)methyl)benzamido)propanoic acid CHEMBL386446
Type:
Small organic molecule
Emp. Form.:
C30H29Cl2N3O4
Mol. Mass.:
566.475
SMILES:
OC(=O)CCNC(=O)c1ccc(CN(C(=O)Nc2cc(Cl)cc(Cl)c2)c2ccc(cc2)C2=CCCCC2)cc1
: