Target
72 kDa type IV collagenase
Ligand
BDBM50204003
Substrate
Meas. Tech.
ChEMBL_441978 (CHEMBL891122)
IC50
140000±n/a nM
Citation
 Vidal, ASabatini, MRolland-Valognes, GRenard, PMadelmont, JCMounetou, E Synthesis and in vitro evaluation of targeted tetracycline derivatives: effects on inhibition of matrix metalloproteinases. Bioorg Med Chem 15:2368-74 (2007)  
Target
Name:
72 kDa type IV collagenase
Synonyms:
72 kDa gelatinase CLG4A Gelatinase A (MMP-2) MMP2_HUMAN Matrix metalloproteinase-2 (MMP 2) Matrix metalloproteinases 2 (MMP-2) | TBE-1
Type:
Enzyme
Mol. Mass.:
73870.36
Organism:
Homo sapiens (Human)
Description:
P08253
Residue:
660
  
Inhibitor
Name:
BDBM50204003
Synonyms:
1,4,4a,5,5a,6,11,12a-octahydro-2-aminocarbo-nyl-3,6,10,12,12a-hexahydroxy-6-methyl-1,11-dioxo-naphthacene-4-trimethylammonium iodide | CHEMBL242073
Type:
Small organic molecule
Emp. Form.:
C23H27N2O8
Mol. Mass.:
459.4685
SMILES:
C[C@]1(O)C2CC3[C@@H](C(=O)C(C(N)=O)C(=O)[C@@]3(O)C(=O)C2C(=O)c2c(O)cccc12)[N+](C)(C)C
: