Target
M1 family aminopeptidase
Ligand
BDBM50206548
Substrate
Meas. Tech.
ChEMBL_428661 (CHEMBL915808)
IC50
1168±n/a nM
Citation
 Flipo, MBeghyn, TLeroux, VFlorent, IDeprez, BPDeprez-Poulain, RF Novel selective inhibitors of the zinc plasmodial aminopeptidase PfA-M1 as potential antimalarial agents. J Med Chem 50:1322-34 (2007)  
Target
Name:
M1 family aminopeptidase
Synonyms:
AMPN_PLAF7 Zinc aminopeptidase | m1-family aminopeptidase
Type:
PROTEIN
Mol. Mass.:
126072.31
Organism:
Plasmodium falciparum (isolate FcB1 / Columbia)
Description:
ChEMBL_735637
Residue:
1085
  
Inhibitor
Name:
BDBM50206548
Synonyms:
2-benzyl-N-biphenyl-3-ylmethyl-N'-hydroxy-malonamide | CHEMBL221337
Type:
Small organic molecule
Emp. Form.:
C23H22N2O3
Mol. Mass.:
374.4324
SMILES:
ONC(=O)C(Cc1ccccc1)C(=O)NCc1cccc(c1)-c1ccccc1
: