Target
M1 family aminopeptidase
Ligand
BDBM50197496
Substrate
Meas. Tech.
ChEMBL_428661 (CHEMBL915808)
IC50
904±n/a nM
Citation
 Flipo, MBeghyn, TLeroux, VFlorent, IDeprez, BPDeprez-Poulain, RF Novel selective inhibitors of the zinc plasmodial aminopeptidase PfA-M1 as potential antimalarial agents. J Med Chem 50:1322-34 (2007)  
Target
Name:
M1 family aminopeptidase
Synonyms:
AMPN_PLAF7 Zinc aminopeptidase | m1-family aminopeptidase
Type:
PROTEIN
Mol. Mass.:
126072.31
Organism:
Plasmodium falciparum (isolate FcB1 / Columbia)
Description:
ChEMBL_735637
Residue:
1085
  
Inhibitor
Name:
BDBM50197496
Synonyms:
CHEMBL220176 N1-(4-chlorobenzyl)-N3-hydroxy-2-isobutylmalonamide
Type:
Small organic molecule
Emp. Form.:
C14H19ClN2O3
Mol. Mass.:
298.765
SMILES:
CC(C)CC(C(=O)NO)C(=O)NCc1ccc(Cl)cc1
: