Target
5-hydroxytryptamine receptor 2A
Ligand
BDBM50210092
Substrate
Meas. Tech.
ChEMBL_443936 (CHEMBL893102)
IC50
0.86±n/a nM
Citation
 Feng, ZMohapatra, SKlimko, PGHellberg, MRMay, JAKelly, CWilliams, GMcLaughlin, MASharif, NA Novel benzodifuran analogs as potent 5-HT2A receptor agonists with ocular hypotensive activity. Bioorg Med Chem Lett 17:2998-3002 (2007)  
Target
Name:
5-hydroxytryptamine receptor 2A
Synonyms:
5-HT-2A 5-HT2A 5-hydroxytryptamine receptor 2A (5HT2A) Htr2 Serotonin Receptor 2A
Type:
G Protein-Coupled Receptor (GPCR)
Mol. Mass.:
52852.05
Organism:
Rattus norvegicus (rat)
Description:
Rat cortex membranes 5-HT2A receptors.
Residue:
471
  
Inhibitor
Name:
BDBM50210092
Synonyms:
3-[8-((R)-2-amino-propyl)-2,3,6,7-tetrahydro-benzo[1,2-b;4,5-b']difuran-4-yl]-propionic acid methyl ester | CHEMBL394508
Type:
Small organic molecule
Emp. Form.:
C17H23NO4
Mol. Mass.:
305.3688
SMILES:
COC(=O)CCc1c2CCOc2c(C[C@@H](C)N)c2CCOc12
: