Target
3-hydroxy-3-methylglutaryl-coenzyme A reductase
Ligand
BDBM50215666
Substrate
Meas. Tech.
ChEMBL_439781 (CHEMBL888891)
IC50
1.8±n/a nM
Citation
 Pfefferkorn, JAChoi, CSong, YTrivedi, BKLarsen, SDAskew, VDillon, LHanselman, JCLin, ZLu, GRobertson, ASekerke, CAuerbach, BPavlovsky, AHarris, MSBainbridge, GCaspers, N Design and synthesis of novel, conformationally restricted HMG-CoA reductase inhibitors. Bioorg Med Chem Lett 17:4531-7 (2007)  
Target
Name:
3-hydroxy-3-methylglutaryl-coenzyme A reductase
Synonyms:
3-hydroxy-3-methylglutaryl-coenzyme A (HMG-CoA) reductase HMDH_HUMAN HMG-CoA reductase (HMGR) | HMGCR
Type:
Enzyme
Mol. Mass.:
97477.10
Organism:
Homo sapiens (Human)
Description:
P04035
Residue:
888
  
Inhibitor
Name:
BDBM50215666
Synonyms:
(3R,5R)-7-(3,4-bis(4-fluorophenyl)-1-isopropyl-5-(phenylcarbamoyl)-1H-pyrrol-2-yl)-3,5-dihydroxyheptanoic acid CHEMBL389002
Type:
Small organic molecule
Emp. Form.:
C33H34F2N2O5
Mol. Mass.:
576.6303
SMILES:
CC(C)n1c(CC[C@@H](O)C[C@@H](O)CC(O)=O)c(c(c1C(=O)Nc1ccccc1)-c1ccc(F)cc1)-c1ccc(F)cc1
: