Target
3-hydroxy-3-methylglutaryl-coenzyme A reductase
Ligand
BDBM50215672
Substrate
Meas. Tech.
ChEMBL_439781 (CHEMBL888891)
IC50
1.9±n/a nM
Citation
 Pfefferkorn, JAChoi, CSong, YTrivedi, BKLarsen, SDAskew, VDillon, LHanselman, JCLin, ZLu, GRobertson, ASekerke, CAuerbach, BPavlovsky, AHarris, MSBainbridge, GCaspers, N Design and synthesis of novel, conformationally restricted HMG-CoA reductase inhibitors. Bioorg Med Chem Lett 17:4531-7 (2007)  
Target
Name:
3-hydroxy-3-methylglutaryl-coenzyme A reductase
Synonyms:
3-hydroxy-3-methylglutaryl-coenzyme A (HMG-CoA) reductase HMDH_HUMAN HMG-CoA reductase (HMGR) | HMGCR
Type:
Enzyme
Mol. Mass.:
97477.10
Organism:
Homo sapiens (Human)
Description:
P04035
Residue:
888
  
Inhibitor
Name:
BDBM50215672
Synonyms:
CHEMBL228528 | sodium (3R,5R)-7-(5-(3-fluorophenyl)-1-(4-fluorophenyl)-3-isopropyl-4-oxo-4,5-dihydro-3H-pyrrolo[2,3-c]quinolin-2-yl)-3,5-dihydroxyheptanoate
Type:
Small organic molecule
Emp. Form.:
C33H31F2N2O5
Mol. Mass.:
573.607
SMILES:
CC(C)n1c(CC[C@@H](O)C[C@@H](O)CC([O-])=O)c(-c2ccc(F)cc2)c2c1c(=O)n(-c1cccc(F)c1)c1ccccc21
: