Target
3-hydroxy-3-methylglutaryl-coenzyme A reductase
Ligand
BDBM50215689
Substrate
Meas. Tech.
ChEMBL_456534 (CHEMBL922900)
IC50
0.3±n/a nM
Citation
 Pfefferkorn, JASong, YSun, KLMiller, SRTrivedi, BKChoi, CSorenson, RJBratton, LDUnangst, PCLarsen, SDPoel, TJCheng, XMLee, CErasga, NAuerbach, BAskew, VDillon, LHanselman, JCLin, ZLu, GRobertson, AOlsen, KMertz, TSekerke, CPavlovsky, AHarris, MSBainbridge, GCaspers, NChen, HEberstadt, M Design and synthesis of hepatoselective, pyrrole-based HMG-CoA reductase inhibitors. Bioorg Med Chem Lett 17:4538-44 (2007)  
Target
Name:
3-hydroxy-3-methylglutaryl-coenzyme A reductase
Synonyms:
3-hydroxy-3-methylglutaryl-coenzyme A (HMG-CoA) reductase HMDH_HUMAN HMG-CoA reductase (HMGR) | HMGCR
Type:
Enzyme
Mol. Mass.:
97477.10
Organism:
Homo sapiens (Human)
Description:
P04035
Residue:
888
  
Inhibitor
Name:
BDBM50215689
Synonyms:
CHEMBL250317 | sodium (3R,5R)-7-(5-((4-carbamoylphenyl)carbamoyl)-3-(4-fluorophenyl)-1-isopropyl-4-phenyl-1H-pyrrol-2-yl)-3,5-dihydroxyheptanoate
Type:
Small organic molecule
Emp. Form.:
C34H35FN3O6
Mol. Mass.:
600.6572
SMILES:
CC(C)n1c(CC[C@@H](O)C[C@@H](O)CC([O-])=O)c(c(c1C(=O)Nc1ccc(cc1)C(N)=O)-c1ccccc1)-c1ccc(F)cc1
: