Target
Cholinesterase
Ligand
BDBM50218508
Substrate
Meas. Tech.
ChEMBL_444936 (CHEMBL894086)
IC50
>0.000±n/a nM
Comments
modified from >0.000010
Citation
 Piazzi, LCavalli, ABelluti, FBisi, AGobbi, SRizzo, SBartolini, MAndrisano, VRecanatini, MRampa, A Extensive SAR and computational studies of 3-{4-[(benzylmethylamino)methyl]phenyl}-6,7-dimethoxy-2H-2-chromenone (AP2238) derivatives. J Med Chem 50:4250-4 (2007)  
Target
Name:
Cholinesterase
Synonyms:
Acylcholine acylhydrolase Butyrylcholine esterase (BChE) Butyrylcholinesterase (BuChE) CHLE_HUMAN Cholinesterases Pseudocholinesterase
Type:
Homotetramer
Mol. Mass.:
68422.27
Organism:
Homo sapiens (Human)
Description:
P06276
Residue:
602
  
Inhibitor
Name:
BDBM50218508
Synonyms:
6,7-dimethoxy-3-(4-{[(3-methoxybenzyl)methylamino]methyl}phenyl)chromen-2-one | CHEMBL245047
Type:
Small organic molecule
Emp. Form.:
C27H27NO5
Mol. Mass.:
445.507
SMILES:
COc1cccc(CN(C)Cc2ccc(cc2)-c2cc3cc(OC)c(OC)cc3oc2=O)c1
: