Target
Kinesin-like protein KIF11
Ligand
BDBM50220964
Substrate
Meas. Tech.
ChEMBL_457441 (CHEMBL941013)
IC50
0.9±n/a nM
Citation
 Garbaccio, RMTasber, ESNeilson, LAColeman, PJFraley, MEOlson, CBergman, JTorrent, MBuser, CARickert, KWalsh, ESHamilton, KLobell, RBTao, WSouth, VJDiehl, REDavide, JPYan, YKuo, LCLi, CPrueksaritanont, TFernandez-Metzler, CMahan, EASlaughter, DESalata, JJKohl, NEHuber, HEHartman, GD Kinesin spindle protein (KSP) inhibitors. Part 7: Design and synthesis of 3,3-disubstituted dihydropyrazolobenzoxazines as potent inhibitors of the mitotic kinesin KSP. Bioorg Med Chem Lett 17:5671-6 (2007)  
Target
Name:
Kinesin-like protein KIF11
Synonyms:
EG5 KIF11_HUMAN Kinesin Spindle Protein Eg5 TRIP5 | kinesin spindle protein
Type:
PROTEIN
Mol. Mass.:
119138.97
Organism:
Homo sapiens (Human)
Description:
ChEMBL_1457426
Residue:
1056
  
Inhibitor
Name:
BDBM50220964
Synonyms:
1-[3-((3R,3aR)-2-acetyl-8-fluoro-3-phenyl-3a,4-dihydro-3H-5-oxa-1,9b-diaza-cyclopenta[a]naphthalen-3-yl)-propyl]-4-methyl-[1,4]diazepan-5-one | CHEMBL251142
Type:
Small organic molecule
Emp. Form.:
C27H31FN4O3
Mol. Mass.:
478.5584
SMILES:
CN1CCN(CCC[C@]2([C@@H]3COc4ccc(F)cc4N3N=C2C(C)=O)c2ccccc2)CCC1=O
: