Target
Polyunsaturated fatty acid lipoxygenase ALOX15B
Ligand
BDBM7460
Substrate
Meas. Tech.
ChEMBL_457827 (CHEMBL924097)
IC50
>100000±n/a nM
Citation
 Vasquez-Martinez, YOhri, RVKenyon, VHolman, TRSepúlveda-Boza, S Structure-activity relationship studies of flavonoids as potent inhibitors of human platelet 12-hLO, reticulocyte 15-hLO-1, and prostate epithelial 15-hLO-2. Bioorg Med Chem 15:7408-25 (2007)  
Target
Name:
Polyunsaturated fatty acid lipoxygenase ALOX15B
Synonyms:
15-LOX-2 15-Lipoxygenase-2 (15-LOX-2) ALOX15B Arachidonate 15-lipoxygenase, type II Epithelial 15-lipoxygenase-2 | LX15B_HUMAN
Type:
Protein
Mol. Mass.:
75850.40
Organism:
Homo sapiens (Human)
Description:
Residue:
676
  
Inhibitor
Name:
BDBM7460
Synonyms:
2-(3,4-dihydroxyphenyl)-3,5,7-trihydroxy-4H-chromen-4-one 2-(3,4-dihydroxyphenyl)-3,5,7-trihydroxy-chromone;hydrate Quercetin Quercetin (21) US11021454, Compound Quercetin med.21724, Compound 4
Type:
Small organic molecule
Emp. Form.:
C15H10O7
Mol. Mass.:
302.2357
SMILES:
Oc1cc(O)c2c(c1)oc(-c1ccc(O)c(O)c1)c(O)c2=O
: